{"text_format":"3","workbook":"xlsx","n_sheets":3,"sheets":["CSSM sand","Ka","Kp"],"not_rendered":{"charts":5,"images":1,"macros":1,"defined_names":81},"read":"whole","date_system":"1900"}

{"sheet":"CSSM sand","index":0,"n_rows":209,"n_cols":19,"rows_kept":209,"merged":[[0,0,0,4],[1,1,1,2],[5,1,5,2],[13,1,13,2],[16,1,16,2]]}
["CSSM Plane‒Strain Incremental Numerical Simulation for Granular Cohesionless Soil"]
[null,"Initial State:"]
[null,"σ'3 (kPa)",{"v":30,"d":"30.00"}]
[null,"Ø’cv,ps (°)",39.61]
[null,"n0 from Eqs. (4-13) or (4-14)",{"$f":"IF(C4>45,(8*SIN((C4)*PI()/180)-(4*PI()/3))/(8*SIN((C4)*PI()/180)),(8*SIN((90-C4)*PI()/180)-(4*PI()/3))/(8*SIN((90-C4)*PI()/180)))","v":{"v":0.32035639901597956,"d":"32.04%"}}]
[null,"Final State:"]
[null,"(σ'1/σ'3)f,cs,ps Eq. (7-12)",{"$f":"INDEX(B27:B100000,COUNTA(B27:B100000))","v":{"v":4.689955934388228,"d":"4.69"}}]
[null,"(σ'1/σ'3)f,cv,ps Eq. (7-3)",{"$f":"(TAN((45+C4/2)*PI()/180))^2","v":{"v":4.518131282171822,"d":"4.52"}}]
[null,"Ø’cs,ps (°)",{"v":49.506575124803035,"d":"49.51"}]
[null,"Tan(Ø’cv,ps)",{"$f":"TAN(C4*PI()/180)","v":{"v":0.82756596799996,"d":"0.83"}}]
[null,"Tan(Ø’cv,ps) from Eq. (4-9)",{"$f":"TAN(C9*PI()/180)*((SIN(60*PI()/180)-SIN(C9*PI()/180))/(COS(C9*PI()/180)-COS(60*PI()/180)))","v":{"v":0.8275662173418508,"d":"0.83"}}]
[null,"check equality",{"$f":"C10/C11","v":{"v":0.9999996987046045,"d":"1.00"}}]
[null,"nc from Eqs. (4-11) or (4-12)",{"$f":"IF(C9>45,(8*SIN((C9)*PI()/180)-(4*PI()/3))/(8*SIN((C9)*PI()/180)),(8*SIN((90-C9)*PI()/180)-(4*PI()/3))/(8*SIN((90-C9)*PI()/180)))","v":{"v":0.31148953496400156,"d":"31.15%"}}]
[null,"Porosity:"]
[null,"Max. Porosity",{"v":0.4764012244017012,"d":"47.64%"}]
[null,"Min. Porosity",{"v":0.2595195103069958,"d":"25.95%"}]
[null,"Computation:"]
[null,"No. Rows or Steps, N",{"v":200,"d":"200.00"}]
[null,"Δα (°) Eq. (7-2)",{"$f":"(C9-C4)/(C18-1)","v":{"v":0.04973153329046752,"d":"0.04973"}}]
[null,"Δα (°) (45.0000)",{"$f":"IF(AND(C9>45,C4<45),(45-C4)/(C18/2),\"NA\")","v":{"v":0.0539,"d":"0.05390"}}]
[null,"No. Rows or Steps, N",{"$f":"IF(AND(C9>45,C4<45),ROUNDDOWN(((C9-C4)+C20)/C20,0),\"NA\")","v":{"v":184,"d":"184.00"}}]
[null,"Precision Eq. (7-11)",{"$f":"IF(AND($C$9>45,$C$4<45),1-((C8-INDEX(B27:B100000,(C18/2)))/C8),1-(C8-MAX(B27:B10000))/C8)","v":{"v":0.9921809837223158,"d":"99.22%"}}]
[]
["step # i","(σ'1/σ'3)i,ps","σ'1 (kPa)","αi (˚)","α0,i (˚)","A","u (kPa)","n","e","Dr","K0","ν","Ꜫ̇̇1ֺ","Ꜫ1","Ꜫ̇̇3","Ꜫ3","Ꜫ̇̇v","Ꜫv","Ꜫs"]
[null,"Eq. (7-4)","(σ'1/σ'3)*σ'3","Eq. (7-1)","Eq. (4-9)","Eq. (4-20)","(σ'1-σ'3)*A","Eq. (4-11) to (4-14)",null,"Eq. (4-23) or (4-26)","Eq. (5-4)","k0/(1+k0) Eq. (7-10)","Eq. (7-7) or Eq. (7-8) ","CUSUM Eq. (7-6)","Ꜫ̇̇3= -Ꜫ̇̇1ֺ*ν Eq. (7-9)","CUSUM","-(Ꜫ̇̇1+Ꜫ̇̇3) Eq. (7-5)","CUSUM","(Ꜫ1-Ꜫ3)"]
[1,{"v":0,"d":"0.0000"},{"v":0,"d":"0.00"},{"$f":"IF(AND($C$9>45,$C$4<45),$C$4+(A26-1)*$C$20,$C$4+(A26-1)*$C$19)","v":{"v":39.61,"d":"39.6100"}},{"$f":"ATAN(TAN(D26*PI()/180)*((SIN(60*PI()/180)-SIN(D26*PI()/180))/(COS(D26*PI()/180)-COS(60*PI()/180))))*180/PI()","v":{"v":34.96215709512142,"d":"34.9622"}},{"$f":"-(1/3)-((TAN(D26*PI()/180)-TAN(E26*PI()/180))/(TAN(D26*PI()/180)*TAN(E26*PI()/180)))","v":{"v":-0.5551279610675963,"d":"-0.56"}},{"v":0,"d":"0.00"},{"$f":"IF(D26>45,(8*SIN((D26)*PI()/180)-(4*PI()/3))/(8*SIN((D26)*PI()/180)),(8*SIN((90-D26)*PI()/180)-(4*PI()/3))/(8*SIN((90-D26)*PI()/180)))","v":{"v":0.32035639901597956,"d":"0.32036"}},{"$f":"H26/(1-H26)","v":{"v":0.47135939859089715,"d":"0.47136"}},{"$f":"((($C$15/(1-$C$15))-(H26/(1-H26)))/(($C$15/(1-$C$15))-($C$16/(1-$C$16))))","v":{"v":0.7838966752556789,"d":"78.39%"}},{"$f":"(SQRT(3/4)-SIN(D26*PI()/180))/(2*COS(D26*PI()/180)-1)","v":{"v":0.4224579719801436,"d":"0.42246"}},{"$f":"K26/(1+K26)","v":{"v":0.2969915317723291,"d":"0.29699"}},{"v":0,"d":"0.00000"},{"v":0,"d":"0.00000"},{"v":0,"d":"0.00000"},{"v":0,"d":"0.00000"},{"v":0,"d":"0.00000"},{"v":0,"d":"0.00000"}]
[{"$f":"A26+1","v":2},{"$f":"$C$8*(1+(Q27/N27))","v":{"v":1.340946781525833,"d":"1.3409"}},{"$f":"B27*$C$3","v":{"v":40.22840344577499,"d":"40.23"}},{"$f":"IF(AND($C$9>45,$C$4<45),$C$4+(A27-1)*$C$20,$C$4+(A27-1)*$C$19)","v":39.6639},{"$f":"ATAN(TAN(D27*PI()/180)*((SIN(60*PI()/180)-SIN(D27*PI()/180))/(COS(D27*PI()/180)-COS(60*PI()/180))))*180/PI()","v":{"v":34.98801180743486,"d":"34.9880"}},{"$f":"-(1/3)-((TAN(D27*PI()/180)-TAN(E27*PI()/180))/(TAN(D27*PI()/180)*TAN(E27*PI()/180)))","v":{"v":-0.5560663405186717,"d":"-0.56"}},{"$f":"(C27-$C$3)*F27","v":{"v":-5.687670873440668,"d":"-5.69"}},{"$f":"IF(D27>45,(8*SIN((D27)*PI()/180)-(4*PI()/3))/(8*SIN((D27)*PI()/180)),(8*SIN((90-D27)*PI()/180)-(4*PI()/3))/(8*SIN((90-D27)*PI()/180)))","v":{"v":0.31982657074848,"d":"0.31983"}},{"$f":"H27/(1-H27)","v":{"v":0.4702132676667849,"d":"0.47021"}},{"$f":"((($C$15/(1-$C$15))-(H27/(1-H27)))/(($C$15/(1-$C$15))-($C$16/(1-$C$16))))","v":{"v":0.7859455883406994,"d":"78.59%"}},{"$f":"(SQRT(3/4)-SIN(D27*PI()/180))/(2*COS(D27*PI()/180)-1)","v":{"v":0.4220550557429669,"d":"0.42206"}},{"$f":"(K27/(1+K27))","v":{"v":0.2967923457242378,"d":"0.29679"}},{"$f":"IF(D27>45,(COS((90-D26)*PI()/180)-COS((90-D27)*PI()/180))/(COS((90-D26)*PI()/180)*(1-L27)),(COS((D26)*PI()/180)-COS((D27)*PI()/180))/(COS((D26)*PI()/180)*(1-L27)))","v":{"v":1.1077247861658803E-3,"d":"0.00111"}},{"$f":"N26+M27","v":{"v":1.1077247861658803E-3,"d":"0.00111"}},{"$f":"-M27*L27","v":{"v":-3.2876423770305131E-4,"d":"-0.00033"}},{"$f":"P26+O27","v":{"v":-3.2876423770305131E-4,"d":"-0.00033"}},{"$f":"-(M27+O27)","v":{"v":-0.000778960548462829,"d":"-0.00078"}},{"$f":"R26+Q27","v":{"v":-0.000778960548462829,"d":"-0.00078"}},{"$f":"(N27-P27)","v":{"v":1.4364890238689316E-3,"d":"0.00144"}}]
[{"$f":"A27+1","v":3},{"$f":"$C$8*(1+(Q28/N28))","v":{"v":2.9277935451631016,"d":"2.9278"}},{"$f":"B28*$C$3","v":{"v":87.83380635489306,"d":"87.83"}},{"$f":"IF(AND($C$9>45,$C$4<45),$C$4+(A28-1)*$C$20,$C$4+(A28-1)*$C$19)","v":39.7178},{"$f":"ATAN(TAN(D28*PI()/180)*((SIN(60*PI()/180)-SIN(D28*PI()/180))/(COS(D28*PI()/180)-COS(60*PI()/180))))*180/PI()","v":{"v":35.01385263283026,"d":"35.0139"}},{"$f":"-(1/3)-((TAN(D28*PI()/180)-TAN(E28*PI()/180))/(TAN(D28*PI()/180)*TAN(E28*PI()/180)))","v":{"v":-0.5570019862610026,"d":"-0.56"}},{"$f":"(C28-$C$3)*F28","v":{"v":-32.21354501270963,"d":"-32.21"}},{"$f":"IF(D28>45,(8*SIN((D28)*PI()/180)-(4*PI()/3))/(8*SIN((D28)*PI()/180)),(8*SIN((90-D28)*PI()/180)-(4*PI()/3))/(8*SIN((90-D28)*PI()/180)))","v":{"v":0.31929531288405943,"d":"0.31930"}},{"$f":"H28/(1-H28)","v":{"v":0.4690658356369973,"d":"0.46907"}},{"$f":"((($C$15/(1-$C$15))-(H28/(1-H28)))/(($C$15/(1-$C$15))-($C$16/(1-$C$16))))","v":{"v":0.7879968273837645,"d":"78.80%"}},{"$f":"(SQRT(3/4)-SIN(D28*PI()/180))/(2*COS(D28*PI()/180)-1)","v":{"v":0.42165245932727713,"d":"0.42165"}},{"$f":"(K28/(1+K28))","v":{"v":0.2965932050135532,"d":"0.29659"}},{"$f":"IF(D28>45,(COS((90-D27)*PI()/180)-COS((90-D28)*PI()/180))/(COS((90-D27)*PI()/180)*(1-L28)),(COS((D27)*PI()/180)-COS((D28)*PI()/180))/(COS((D27)*PI()/180)*(1-L28)))","v":{"v":1.1095326119912503E-3,"d":"0.00111"}},{"$f":"N27+M28","v":{"v":0.002217257398157131,"d":"0.00222"}},{"$f":"-M28*L28","v":{"v":-3.2907983345754405E-4,"d":"-0.00033"}},{"$f":"P27+O28","v":{"v":-6.5784407116059531E-4,"d":"-0.00066"}},{"$f":"-(M28+O28)","v":{"v":-7.8045277853370631E-4,"d":"-0.00078"}},{"$f":"R27+Q28","v":{"v":-1.5594133269965353E-3,"d":"-0.00156"}},{"$f":"(N28-P28)","v":{"v":0.002875101469317726,"d":"0.00288"}}]
[4,{"v":3.4567419523834473,"d":"3.4567"},{"v":103.70225857150342,"d":"103.70"},39.7717,{"v":35.039679702282676,"d":"35.0397"},{"v":-0.5579349064056845,"d":"-0.56"},{"v":-41.12106273797932,"d":"-41.12"},{"v":0.31876262112887876,"d":"0.31876"},{"v":0.4679171035169862,"d":"0.46792"},{"v":0.7900503905695734,"d":"79.01%"},{"v":0.42125018217449794,"d":"0.42125"},{"v":0.2963941095367106,"d":"0.29639"},{"v":1.1113427970557322E-3,"d":"0.00111"},{"v":0.003328600195212863,"d":"0.00333"},{"v":-0.000329395458723371,"d":"-0.00033"},{"v":-9.8723952988396635E-4,"d":"-0.00099"},{"v":-7.8194733833236111E-4,"d":"-0.00078"},{"v":-2.3413606653288964E-3,"d":"-0.00234"},{"v":0.004315839725096829,"d":"0.00432"}]
[5,{"v":3.721215766787749,"d":"3.7212"},{"v":111.63647300363246,"d":"111.64"},39.8256,{"v":35.06549314671836,"d":"35.0655"},{"v":-0.5588651090106959,"d":"-0.56"},{"v":-45.623776384423785,"d":"-45.62"},{"v":0.3182284911700371,"d":"0.31823"},{"v":0.4667670723233534,"d":"0.46677"},{"v":0.7921062760807691,"d":"79.21%"},{"v":0.42084822372721997,"d":"0.42085"},{"v":0.29619505919023204,"d":"0.29620"},{"v":1.1131553510675828E-3,"d":"0.00111"},{"v":0.004441755546280446,"d":"0.00444"},{"v":-3.2971111509738621E-4,"d":"-0.00033"},{"v":-1.3169506449813525E-3,"d":"-0.00132"},{"v":-7.8344423597019662E-4,"d":"-0.00078"},{"v":-3.1248049012990928E-3,"d":"-0.00312"},{"v":0.005758706191261799,"d":"0.00576"}]
{"$rows_left_out":180}
{"sheet":"Ka","index":1,"n_rows":32,"n_cols":8,"rows_kept":32,"merged":[[8,1,8,7],[20,1,20,7]]}
[null,"Ø’cs,ps",{"$f":"'CSSM sand'!C9","v":{"v":49.506575124803035,"d":"49.51"}},"°"]
[null,"H",3,"m"]
[null,"ꜪH,cs,ps",{"$f":"IF(INDEX('CSSM sand'!P27:P100000,COUNTA('CSSM sand'!P27:P100000))<0,INDEX('CSSM sand'!P27:P100000,COUNTA('CSSM sand'!P27:P100000)),INDEX('CSSM sand'!N27:N100000,COUNTA('CSSM sand'!N27:N100000)))","v":{"v":-0.007791538221390978,"d":"-0.00779"}}]
[null,"Δx/Hrotation",{"$f":"D10/(C2*1000)","v":{"v":0.019,"d":"1.90%"}}]
[null,"Δx/Htranslation",{"$f":"D22/(C2*1000)","v":{"v":0.009333333333333334,"d":"0.93%"}}]
[]
[]
[null,"depth avg.","y (m)","wall δ (mm)","wall δavg.  (mm)","x (m)","ꜪH,wall","CS ?"]
[null,"Outward rotation about the base:"]
[null,{"v":0,"d":"0.00"},null,{"v":57,"d":"57.00"}]
[null,{"$f":"B10+($C$2/10)","v":{"v":0.3,"d":"0.30"}},{"$f":"$C$2-AVERAGE(B10:B11)","v":2.85},{"$f":"D10-($D$10/COUNTA($B$11:$B$20))","v":{"v":51.3,"d":"51.30"}},{"$f":"AVERAGE(D10:D11)","v":54.15},{"$f":"(LN(C11+1))/TAN($C$1*PI()/180)","v":{"v":1.151095715488421,"d":"1.15"}},{"$f":"-E11/(F11*1000)","v":{"v":-0.04704213496010072,"d":"-0.04704"}},{"$f":"IF(OR(G11<$C$3,G11=$C$3),\"yes\",\"no\")","v":"yes"}]
[null,{"$f":"B11+($C$2/10)","v":{"v":0.6,"d":"0.60"}},{"$f":"$C$2-AVERAGE(B11:B12)","v":2.55},{"$f":"D11-($D$10/COUNTA($B$11:$B$20))","v":{"v":45.599999999999994,"d":"45.60"}},{"$f":"AVERAGE(D11:D12)","v":{"v":48.449999999999996,"d":"48.45"}},{"v":1.081824053807477,"d":"1.08"},{"$f":"-E12/(F12*1000)","v":{"v":-0.04478547119513598,"d":"-0.04479"}},{"$f":"IF(OR(G12<$C$3,G12=$C$3),\"yes\",\"no\")","v":"yes"}]
[null,{"v":0.8999999999999999,"d":"0.90"},2.25,{"v":39.89999999999999,"d":"39.90"},{"v":42.74999999999999,"d":"42.75"},{"v":1.0064325649087618,"d":"1.01"},{"v":-0.04247676544913419,"d":"-0.04248"},"yes"]
[null,{"v":1.2,"d":"1.20"},{"v":1.9500000000000002,"d":"1.95"},{"v":34.19999999999999,"d":"34.20"},{"v":37.04999999999999,"d":"37.05"},{"v":0.9237342188409641,"d":"0.92"},{"v":-0.04010893961088471,"d":"-0.04011"},"yes"]
[null,{"v":1.5,"d":"1.50"},1.65,{"v":28.49999999999999,"d":"28.50"},{"v":31.349999999999987,"d":"31.35"},{"v":0.8321591654760815,"d":"0.83"},{"v":-0.0376730814255522,"d":"-0.03767"},"yes"]
[null,{"v":1.8,"d":"1.80"},1.35,{"v":22.79999999999999,"d":"22.80"},{"v":25.64999999999999,"d":"25.65"},{"v":0.7295700717194581,"d":"0.73"},{"v":-0.03515769217279954,"d":"-0.03516"},"yes"]
[null,{"v":2.1,"d":"2.10"},{"v":1.0499999999999998,"d":"1.05"},{"v":17.09999999999999,"d":"17.10"},{"v":19.94999999999999,"d":"19.95"},{"v":0.6129506483714392,"d":"0.61"},{"v":-0.032547481682261924,"d":"-0.03255"},"yes"]
[null,{"v":2.4,"d":"2.40"},0.75,{"v":11.399999999999991,"d":"11.40"},{"v":14.249999999999991,"d":"14.25"},{"v":0.47784598085395197,"d":"0.48"},{"v":-0.029821324382668265,"d":"-0.02982"},"yes"]
[null,{"v":2.6999999999999997,"d":"2.70"},{"v":0.4500000000000002,"d":"0.45"},{"v":5.699999999999991,"d":"5.70"},{"$f":"AVERAGE(D18:D19)","v":{"v":8.549999999999992,"d":"8.55"}},{"v":0.3172715207483589,"d":"0.32"},{"v":-0.026948526548594157,"d":"-0.02695"},"yes"]
[null,{"$f":"B19+($C$2/10)","v":{"v":2.9999999999999996,"d":"3.00"}},{"v":0.15000000000000036,"d":"0.15"},{"v":-8.881784197001252e-15,"d":"-0.00"},{"$f":"AVERAGE(D19:D20)","v":{"v":2.849999999999991,"d":"2.85"}},{"v":0.11934024000055204,"d":"0.12"},{"v":-0.023881299383902762,"d":"-0.02388"},"yes"]
[null,"Outward translation:"]
[null,{"v":0,"d":"0.00"},null,{"v":28,"d":"28.00"}]
[null,{"$f":"B22+($C$2/10)","v":{"v":0.3,"d":"0.30"}},{"$f":"$C$2-AVERAGE(B22:B23)","v":2.85},{"$f":"D22","v":{"v":28,"d":"28.00"}},{"$f":"$D$22","v":{"v":28,"d":"28.00"}},{"$f":"(LN(C23+1))/TAN($C$1*PI()/180)","v":{"v":1.151095715488421,"d":"1.15"}},{"$f":"-E23/(F23*1000)","v":{"v":-0.024324649656192434,"d":"-0.02432"}},{"$f":"IF(OR(G23<$C$3,G23=$C$3),\"yes\",\"no\")","v":"yes"}]
[null,{"$f":"B23+($C$2/10)","v":{"v":0.6,"d":"0.60"}},{"$f":"$C$2-AVERAGE(B23:B24)","v":2.55},{"$f":"D23","v":{"v":28,"d":"28.00"}},{"$f":"$D$22","v":{"v":28,"d":"28.00"}},{"$f":"(LN(C24+1))/TAN($C$1*PI()/180)","v":{"v":1.081824053807477,"d":"1.08"}},{"v":-0.025882212455393346,"d":"-0.02588"},"yes"]
[null,{"v":0.8999999999999999,"d":"0.90"},2.25,{"v":28,"d":"28.00"},{"v":28,"d":"28.00"},{"v":1.0064325649087618,"d":"1.01"},{"v":-0.02782103935849725,"d":"-0.02782"},"yes"]
[null,{"v":1.2,"d":"1.20"},{"v":1.9500000000000002,"d":"1.95"},{"v":28,"d":"28.00"},{"v":28,"d":"28.00"},{"v":0.9237342188409641,"d":"0.92"},{"v":-0.03031174923359709,"d":"-0.03031"},"yes"]
[null,{"v":1.5,"d":"1.50"},1.65,{"v":28,"d":"28.00"},{"v":28,"d":"28.00"},{"v":0.8321591654760815,"d":"0.83"},{"v":-0.03364740924770214,"d":"-0.03365"},"yes"]
[null,{"v":1.8,"d":"1.80"},1.35,{"v":28,"d":"28.00"},{"v":28,"d":"28.00"},{"v":0.7295700717194581,"d":"0.73"},{"v":-0.038378767284147665,"d":"-0.03838"},"yes"]
[null,{"v":2.1,"d":"2.10"},{"v":1.0499999999999998,"d":"1.05"},{"v":28,"d":"28.00"},{"v":28,"d":"28.00"},{"v":0.6129506483714392,"d":"0.61"},{"v":-0.04568067604527992,"d":"-0.04568"},"yes"]
[null,{"v":2.4,"d":"2.40"},0.75,{"v":28,"d":"28.00"},{"v":28,"d":"28.00"},{"v":0.47784598085395197,"d":"0.48"},{"v":-0.05859628650629558,"d":"-0.05860"},"yes"]
{"$rows_left_out":3}
{"sheet":"Kp","index":2,"n_rows":32,"n_cols":8,"rows_kept":32,"merged":[[8,1,8,7],[20,1,20,7]]}
[null,"Ø’cs,ps",{"$f":"'CSSM sand'!C9","v":{"v":49.506575124803035,"d":"49.51"}},"°"]
[null,"H",3,"m"]
[null,"ꜪH,cs,ps",{"$f":"ABS(IF(INDEX('CSSM sand'!P27:P100000,COUNTA('CSSM sand'!P27:P100000))<0,INDEX('CSSM sand'!P27:P100000,COUNTA('CSSM sand'!P27:P100000)),INDEX('CSSM sand'!N27:N100000,COUNTA('CSSM sand'!N27:N100000))))","v":{"v":0.007791538221390978,"d":"0.00779"}}]
[null,"Δx/Hrotation",{"$f":"D10/(C2*1000)","v":{"v":0.03866666666666667,"d":"3.87%"}}]
[null,"Δx/Htranslation",{"$f":"D22/(C2*1000)","v":{"v":0.021666666666666667,"d":"2.17%"}}]
[]
[]
[null,"depth avg.","y (m)","wall δ (mm)","wall δavg.  (mm)","x (m)","ꜪH,wall","CS ?"]
[null,"Inward rotation about the base:"]
[null,{"v":0,"d":"0.00"},null,{"v":116,"d":"116.00"}]
[null,{"$f":"B10+($C$2/10)","v":{"v":0.3,"d":"0.30"}},{"$f":"$C$2-AVERAGE(B10:B11)","v":2.85},{"$f":"D10-($D$10/COUNTA($B$11:$B$20))","v":{"v":104.4,"d":"104.40"}},{"$f":"AVERAGE(D10:D11)","v":{"v":110.2,"d":"110.20"}},{"$f":"(LN(C11+1)*($C$2+1))/TAN((90-$C$1)*PI()/180)","v":{"v":6.31503076143602,"d":"6.32"}},{"$f":"E11/(F11*1000)","v":{"v":0.017450429643661915,"d":"0.01745"}},{"$f":"IF(OR(G11>$C$3,G11=$C$3),\"yes\",\"no\")","v":"yes"}]
[null,{"$f":"B11+($C$2/10)","v":{"v":0.6,"d":"0.60"}},{"$f":"$C$2-AVERAGE(B11:B12)","v":2.55},{"$f":"D11-($D$10/COUNTA($B$11:$B$20))","v":{"v":92.80000000000001,"d":"92.80"}},{"$f":"AVERAGE(D11:D12)","v":{"v":98.60000000000001,"d":"98.60"}},{"$f":"(LN(C12+1)*($C$2+1))/TAN((90-$C$1)*PI()/180)","v":{"v":5.93499922407135,"d":"5.93"}},{"$f":"E12/(F12*1000)","v":{"v":0.01661331303972124,"d":"0.01661"}},{"$f":"IF(OR(G12>$C$3,G12=$C$3),\"yes\",\"no\")","v":"yes"}]
[null,{"v":0.8999999999999999,"d":"0.90"},2.25,{"v":81.20000000000002,"d":"81.20"},{"v":87.00000000000001,"d":"87.00"},{"v":5.5213936783814885,"d":"5.52"},{"v":0.01575689129732599,"d":"0.01576"},"yes"]
[null,{"v":1.2,"d":"1.20"},{"v":1.9500000000000002,"d":"1.95"},{"v":69.60000000000002,"d":"69.60"},{"v":75.40000000000002,"d":"75.40"},{"v":5.067701954651607,"d":"5.07"},{"v":0.014878538768601202,"d":"0.01488"},"yes"]
[null,{"v":1.5,"d":"1.50"},1.65,{"v":58.00000000000002,"d":"58.00"},{"v":63.800000000000026,"d":"63.80"},{"v":4.565311691880105,"d":"4.57"},{"v":0.013974949424258405,"d":"0.01397"},"yes"]
[null,{"v":1.8,"d":"1.80"},1.35,{"v":46.40000000000002,"d":"46.40"},{"v":52.20000000000002,"d":"52.20"},{"v":4.002497258515603,"d":"4.00"},{"v":0.013041857777401529,"d":"0.01304"},"yes"]
[null,{"v":2.1,"d":"2.10"},{"v":1.0499999999999998,"d":"1.05"},{"v":34.80000000000002,"d":"34.80"},{"v":40.60000000000002,"d":"40.60"},{"v":3.3627109784396803,"d":"3.36"},{"v":0.012073591890683001,"d":"0.01207"},"yes"]
[null,{"v":2.4,"d":"2.40"},0.75,{"v":23.200000000000017,"d":"23.20"},{"v":29.000000000000018,"d":"29.00"},{"v":2.621512727150472,"d":"2.62"},{"v":0.011062315166221753,"d":"0.01106"},"yes"]
[null,{"v":2.6999999999999997,"d":"2.70"},{"v":0.4500000000000002,"d":"0.45"},{"v":11.600000000000017,"d":"11.60"},{"v":17.400000000000016,"d":"17.40"},{"v":1.7405845459196545,"d":"1.74"},{"v":0.009996641668909314,"d":"0.01000"},"yes"]
[null,{"v":2.9999999999999996,"d":"3.00"},{"v":0.15000000000000036,"d":"0.15"},{"v":1.7763568394002505E-14,"d":"0.00"},{"v":5.800000000000018,"d":"5.80"},{"v":0.6547129630839326,"d":"0.65"},{"v":0.008858843992762783,"d":"0.00886"},"yes"]
[null,"Inward translation:"]
[null,{"v":0,"d":"0.00"},null,{"v":65,"d":"65.00"}]
[null,{"$f":"B22+($C$2/10)","v":{"v":0.3,"d":"0.30"}},{"$f":"$C$2-AVERAGE(B22:B23)","v":2.85},{"$f":"D22","v":{"v":65,"d":"65.00"}},{"$f":"$D$22","v":{"v":65,"d":"65.00"}},{"$f":"(LN(C23+1)*($C$2+1))/TAN((90-$C$1)*PI()/180)","v":{"v":6.31503076143602,"d":"6.32"}},{"$f":"E23/(F23*1000)","v":{"v":0.010292903147350495,"d":"0.01029"}},{"$f":"IF(OR(G23>$C$3,G23=$C$3),\"yes\",\"no\")","v":"yes"}]
[null,{"$f":"B23+($C$2/10)","v":{"v":0.6,"d":"0.60"}},{"$f":"$C$2-AVERAGE(B23:B24)","v":2.55},{"$f":"D23","v":{"v":65,"d":"65.00"}},{"$f":"$D$22","v":{"v":65,"d":"65.00"}},{"$f":"(LN(C24+1)*($C$2+1))/TAN((90-$C$1)*PI()/180)","v":{"v":5.93499922407135,"d":"5.93"}},{"$f":"E24/(F24*1000)","v":{"v":0.010951981212797978,"d":"0.01095"}},{"$f":"IF(OR(G24>$C$3,G24=$C$3),\"yes\",\"no\")","v":"yes"}]
[null,{"v":0.8999999999999999,"d":"0.90"},2.25,{"v":65,"d":"65.00"},{"v":65,"d":"65.00"},{"v":5.5213936783814885,"d":"5.52"},{"v":0.011772390049726312,"d":"0.01177"},"yes"]
[null,{"v":1.2,"d":"1.20"},{"v":1.9500000000000002,"d":"1.95"},{"v":65,"d":"65.00"},{"v":65,"d":"65.00"},{"v":5.067701954651607,"d":"5.07"},{"v":0.012826326524656205,"d":"0.01283"},"yes"]
[null,{"v":1.5,"d":"1.50"},1.65,{"v":65,"d":"65.00"},{"v":65,"d":"65.00"},{"v":4.565311691880105,"d":"4.57"},{"v":0.014237801137567334,"d":"0.01424"},"yes"]
[null,{"v":1.8,"d":"1.80"},1.35,{"v":65,"d":"65.00"},{"v":65,"d":"65.00"},{"v":4.002497258515603,"d":"4.00"},{"v":0.016239861217070866,"d":"0.01624"},"yes"]
[null,{"v":2.1,"d":"2.10"},{"v":1.0499999999999998,"d":"1.05"},{"v":65,"d":"65.00"},{"v":65,"d":"65.00"},{"v":3.3627109784396803,"d":"3.36"},{"v":0.019329642189517108,"d":"0.01933"},"yes"]
[null,{"v":2.4,"d":"2.40"},0.75,{"v":65,"d":"65.00"},{"v":65,"d":"65.00"},{"v":2.621512727150472,"d":"2.62"},{"v":0.024794844338083225,"d":"0.02479"},"yes"]
{"$rows_left_out":2}